{"text_format":"1","workbook":"xlsx","n_sheets":3,"sheets":["Sheet1","Sheet2","Sheet3"],"not_rendered":{"charts":1,"images":1,"macros":0,"external_links":0,"defined_names":12,"comments":1,"pivot_tables":0},"unopened":[],"bounds":{"document_bytes":16777216,"sheet_cells":100000,"rows_first":2000,"rows_last":500,"rows_between":2000,"halvings":0,"cell_chars":16384,"cell_head_chars":4096},"cells_cut":0,"cells_raw":0,"read":"whole","date_system":"1900"}

{"sheet":"Sheet1","index":0,"n_rows":46,"n_cols":13,"rows_kept":46,"cut":false,"hidden":false,"merged":[]}
[null,"         The Graph of a Polynomial"]
[]
[null,"           This graphing utility produces the graph "]
[null,"          of any desired polynomial (up to 8th degree)"]
[null,"   y = c0x8+c1x7+c2x6+c3x5+c4x4+c5x3+c6x2+c7x+c8"]
[null,"where  c0, c1, c2, c3, c4, c5, c6, c7, c8 are any coefficients"]
[null,"             on any interval from x = a  to x = b."]
[]
["First enter the value for each of the coefficients in"]
["      "," y = c0x8+ c1x7+ c2x6+ c3x5+ c4x4+ c5x3+ c6x2+ c7x+ c8"]
[null,"(Use 0's if you don't want some of the terms)"]
[]
["c0 =",2]
["c1 =",-1]
["c2 =",5]
["c3 =",-6,null,null,null,null,null,{"$f":"\"The graph of y = \" &TEXT(a0,\"0.00\") &\"x^8+\"&TEXT(b0,\"0.00\")&\"x^7 + \" &TEXT(c0,\"0.00\") &\"x^6+\"&TEXT(d0,\"0.00\")&\"x^5 +\"&TEXT(e0,\"0.00\")&\"x^4 + \" &TEXT(f0,\"0.00\") &\"x^3+\"&TEXT(g0,\"0.00\")&\"x^2 +\" &TEXT(h0,\"0.00\") &\"x+\"&TEXT(i0,\"0.00\")","v":"The graph of y = 2.00x^8+-1.00x^7 + 5.00x^6+-6.00x^5 +3.00x^4 + 0.00x^3+2.00x^2 +5.00x+-4.00"}]
["c4 =",3]
["c5 =",0]
["c6 =",2,null,null,null,null,null,null,"   Select the point on the curve x0 =",null,null,null,{"$f":"xMin+L21*dx","v":0.20999999999999996}]
["c7 =",5]
["c8 =",-4,null,null,null,null,null,null,null,null,null,121]
[]
[]
[null,null,null,null,null,null,null,null,"The value of the function at x0 = ",null,null,null,{"$f":"M19","v":0.20999999999999996}]
["Now enter the interval for x:  ",null,null,null,null,null,null,null,null,null,null,"is  y =",{"$f":"LOOKUP(M24,Sheet2!A3:A203,Sheet2!B3:B203)","v":-2.9168076799999954}]
[null,"xMin =",-1]
[null,"xMax =",1]
[]
[]
[]
[]
["Click each item below for suggestions and investigations"]
[null,"   Item 1"]
[null,"   Item 2"]
[null,"   Item 3"]
[]
[]
[]
[]
[]
[]
["Created by:  Sheldon P. Gordon"]
["                     Farmingdale StateCollege"]
["Development of this module was supported by the "]
["NSF's Division of Undergraduate Education  "]
["under grants DUE-0310123 and DUE-0442160."]

{"sheet":"Sheet2","index":1,"n_rows":204,"n_cols":6,"rows_kept":204,"cut":false,"hidden":false,"merged":[]}
[]
["x","y"]
[{"$f":"xMin","v":-1},{"$f":"Sheet1!$B$13*A3^8+Sheet1!$B$14*A3^7+Sheet1!$B$15*A3^6+Sheet1!$B$16*A3^5+Sheet1!$B$17*A3^4+Sheet1!$B$18*A3^3+Sheet1!$B$19*A3^2+Sheet1!$B$20*A3+Sheet1!$B$21","v":10},null,null,"DeltaX=",{"$f":"(xMax - xMin)/200","v":0.01}]
[{"$f":"A3+dx","v":-0.99},{"$f":"Sheet1!$B$13*A4^8+Sheet1!$B$14*A4^7+Sheet1!$B$15*A4^6+Sheet1!$B$16*A4^5+Sheet1!$B$17*A4^4+Sheet1!$B$18*A4^3+Sheet1!$B$19*A4^2+Sheet1!$B$20*A4+Sheet1!$B$21","v":9.0828838131678289}]
[-0.98,{"$f":"Sheet1!$B$13*A5^8+Sheet1!$B$14*A5^7+Sheet1!$B$15*A5^6+Sheet1!$B$16*A5^5+Sheet1!$B$17*A5^4+Sheet1!$B$18*A5^3+Sheet1!$B$19*A5^2+Sheet1!$B$20*A5+Sheet1!$B$21","v":8.210292743530287}]
[-0.97,{"$f":"Sheet1!$B$13*A6^8+Sheet1!$B$14*A6^7+Sheet1!$B$15*A6^6+Sheet1!$B$16*A6^5+Sheet1!$B$17*A6^4+Sheet1!$B$18*A6^3+Sheet1!$B$19*A6^2+Sheet1!$B$20*A6+Sheet1!$B$21","v":7.3804121725015204},null,null,"Point"]
[-0.96,{"$f":"Sheet1!$B$13*A7^8+Sheet1!$B$14*A7^7+Sheet1!$B$15*A7^6+Sheet1!$B$16*A7^5+Sheet1!$B$17*A7^4+Sheet1!$B$18*A7^3+Sheet1!$B$19*A7^2+Sheet1!$B$20*A7+Sheet1!$B$21","v":6.5914914501558286},null,null,{"$f":"Sheet1!M24","v":0.20999999999999996},{"$f":"Sheet1!M25","v":-2.9168076799999954}]
[-0.95,{"$f":"Sheet1!$B$13*A8^8+Sheet1!$B$14*A8^7+Sheet1!$B$15*A8^6+Sheet1!$B$16*A8^5+Sheet1!$B$17*A8^4+Sheet1!$B$18*A8^3+Sheet1!$B$19*A8^2+Sheet1!$B$20*A8+Sheet1!$B$21","v":5.8418419867968758}]
[-0.94,{"$f":"Sheet1!$B$13*A9^8+Sheet1!$B$14*A9^7+Sheet1!$B$15*A9^6+Sheet1!$B$16*A9^5+Sheet1!$B$17*A9^4+Sheet1!$B$18*A9^3+Sheet1!$B$19*A9^2+Sheet1!$B$20*A9+Sheet1!$B$21","v":5.1298353909548027}]
[-0.92999999999999994,{"$f":"Sheet1!$B$13*A10^8+Sheet1!$B$14*A10^7+Sheet1!$B$15*A10^6+Sheet1!$B$16*A10^5+Sheet1!$B$17*A10^4+Sheet1!$B$18*A10^3+Sheet1!$B$19*A10^2+Sheet1!$B$20*A10+Sheet1!$B$21","v":4.4539016529826441}]
[-0.91999999999999993,{"$f":"Sheet1!$B$13*A11^8+Sheet1!$B$14*A11^7+Sheet1!$B$15*A11^6+Sheet1!$B$16*A11^5+Sheet1!$B$17*A11^4+Sheet1!$B$18*A11^3+Sheet1!$B$19*A11^2+Sheet1!$B$20*A11+Sheet1!$B$21","v":3.8125273734315979}]
[-0.90999999999999992,{"$f":"Sheet1!$B$13*A12^8+Sheet1!$B$14*A12^7+Sheet1!$B$15*A12^6+Sheet1!$B$16*A12^5+Sheet1!$B$17*A12^4+Sheet1!$B$18*A12^3+Sheet1!$B$19*A12^2+Sheet1!$B$20*A12+Sheet1!$B$21","v":3.2042540353926077}]
[-0.89999999999999991,{"$f":"Sheet1!$B$13*A13^8+Sheet1!$B$14*A13^7+Sheet1!$B$15*A13^6+Sheet1!$B$16*A13^5+Sheet1!$B$17*A13^4+Sheet1!$B$18*A13^3+Sheet1!$B$19*A13^2+Sheet1!$B$20*A13+Sheet1!$B$21","v":2.6276763199999937}]
[-0.8899999999999999,{"$f":"Sheet1!$B$13*A14^8+Sheet1!$B$14*A14^7+Sheet1!$B$15*A14^6+Sheet1!$B$16*A14^5+Sheet1!$B$17*A14^4+Sheet1!$B$18*A14^3+Sheet1!$B$19*A14^2+Sheet1!$B$20*A14+Sheet1!$B$21","v":2.0814404643006981}]
[-0.87999999999999989,{"$f":"Sheet1!$B$13*A15^8+Sheet1!$B$14*A15^7+Sheet1!$B$15*A15^6+Sheet1!$B$16*A15^5+Sheet1!$B$17*A15^4+Sheet1!$B$18*A15^3+Sheet1!$B$19*A15^2+Sheet1!$B$20*A15+Sheet1!$B$21","v":1.5642426607009758}]
[-0.86999999999999988,{"$f":"Sheet1!$B$13*A16^8+Sheet1!$B$14*A16^7+Sheet1!$B$15*A16^6+Sheet1!$B$16*A16^5+Sheet1!$B$17*A16^4+Sheet1!$B$18*A16^3+Sheet1!$B$19*A16^2+Sheet1!$B$20*A16+Sheet1!$B$21","v":1.0748274972102489}]
[-0.85999999999999988,{"$f":"Sheet1!$B$13*A17^8+Sheet1!$B$14*A17^7+Sheet1!$B$15*A17^6+Sheet1!$B$16*A17^5+Sheet1!$B$17*A17^4+Sheet1!$B$18*A17^3+Sheet1!$B$19*A17^2+Sheet1!$B$20*A17+Sheet1!$B$21","v":0.61198643771012762}]
[-0.84999999999999987,{"$f":"Sheet1!$B$13*A18^8+Sheet1!$B$14*A18^7+Sheet1!$B$15*A18^6+Sheet1!$B$16*A18^5+Sheet1!$B$17*A18^4+Sheet1!$B$18*A18^3+Sheet1!$B$19*A18^2+Sheet1!$B$20*A18+Sheet1!$B$21","v":0.17455634148437138}]
[-0.83999999999999986,{"$f":"Sheet1!$B$13*A19^8+Sheet1!$B$14*A19^7+Sheet1!$B$15*A19^6+Sheet1!$B$16*A19^5+Sheet1!$B$17*A19^4+Sheet1!$B$18*A19^3+Sheet1!$B$19*A19^2+Sheet1!$B$20*A19+Sheet1!$B$21","v":-0.23858197874606546}]
[-0.82999999999999985,{"$f":"Sheet1!$B$13*A20^8+Sheet1!$B$14*A20^7+Sheet1!$B$15*A20^6+Sheet1!$B$16*A20^5+Sheet1!$B$17*A20^4+Sheet1!$B$18*A20^3+Sheet1!$B$19*A20^2+Sheet1!$B$20*A20+Sheet1!$B$21","v":-0.62850516103092779}]
[-0.81999999999999984,{"$f":"Sheet1!$B$13*A21^8+Sheet1!$B$14*A21^7+Sheet1!$B$15*A21^6+Sheet1!$B$16*A21^5+Sheet1!$B$17*A21^4+Sheet1!$B$18*A21^3+Sheet1!$B$19*A21^2+Sheet1!$B$20*A21+Sheet1!$B$21","v":-0.99624866138132973}]
[-0.80999999999999983,{"$f":"Sheet1!$B$13*A22^8+Sheet1!$B$14*A22^7+Sheet1!$B$15*A22^6+Sheet1!$B$16*A22^5+Sheet1!$B$17*A22^4+Sheet1!$B$18*A22^3+Sheet1!$B$19*A22^2+Sheet1!$B$20*A22+Sheet1!$B$21","v":-1.3428080846750277}]
[-0.79999999999999982,{"$f":"Sheet1!$B$13*A23^8+Sheet1!$B$14*A23^7+Sheet1!$B$15*A23^6+Sheet1!$B$16*A23^5+Sheet1!$B$17*A23^4+Sheet1!$B$18*A23^3+Sheet1!$B$19*A23^2+Sheet1!$B$20*A23+Sheet1!$B$21","v":-1.6691404800000065}]
[-0.78999999999999981,{"$f":"Sheet1!$B$13*A24^8+Sheet1!$B$14*A24^7+Sheet1!$B$15*A24^6+Sheet1!$B$16*A24^5+Sheet1!$B$17*A24^4+Sheet1!$B$18*A24^3+Sheet1!$B$19*A24^2+Sheet1!$B$20*A24+Sheet1!$B$21","v":-1.976165601152104}]
[-0.7799999999999998,{"$f":"Sheet1!$B$13*A25^8+Sheet1!$B$14*A25^7+Sheet1!$B$15*A25^6+Sheet1!$B$16*A25^5+Sheet1!$B$17*A25^4+Sheet1!$B$18*A25^3+Sheet1!$B$19*A25^2+Sheet1!$B$20*A25+Sheet1!$B$21","v":-2.2647671329942578}]
[-0.7699999999999998,{"$f":"Sheet1!$B$13*A26^8+Sheet1!$B$14*A26^7+Sheet1!$B$15*A26^6+Sheet1!$B$16*A26^5+Sheet1!$B$17*A26^4+Sheet1!$B$18*A26^3+Sheet1!$B$19*A26^2+Sheet1!$B$20*A26+Sheet1!$B$21","v":-2.5357938843769396}]
[-0.75999999999999979,{"$f":"Sheet1!$B$13*A27^8+Sheet1!$B$14*A27^7+Sheet1!$B$15*A27^6+Sheet1!$B$16*A27^5+Sheet1!$B$17*A27^4+Sheet1!$B$18*A27^3+Sheet1!$B$19*A27^2+Sheet1!$B$20*A27+Sheet1!$B$21","v":-2.7900609483112504}]
[-0.74999999999999978,{"$f":"Sheet1!$B$13*A28^8+Sheet1!$B$14*A28^7+Sheet1!$B$15*A28^6+Sheet1!$B$16*A28^5+Sheet1!$B$17*A28^4+Sheet1!$B$18*A28^3+Sheet1!$B$19*A28^2+Sheet1!$B$20*A28+Sheet1!$B$21","v":-3.0283508300781303}]
[-0.73999999999999977,{"$f":"Sheet1!$B$13*A29^8+Sheet1!$B$14*A29^7+Sheet1!$B$15*A29^6+Sheet1!$B$16*A29^5+Sheet1!$B$17*A29^4+Sheet1!$B$18*A29^3+Sheet1!$B$19*A29^2+Sheet1!$B$20*A29+Sheet1!$B$21","v":-3.2514145439490103}]
[-0.72999999999999976,{"$f":"Sheet1!$B$13*A30^8+Sheet1!$B$14*A30^7+Sheet1!$B$15*A30^6+Sheet1!$B$16*A30^5+Sheet1!$B$17*A30^4+Sheet1!$B$18*A30^3+Sheet1!$B$19*A30^2+Sheet1!$B$20*A30+Sheet1!$B$21","v":-3.4599726791852197}]
[-0.71999999999999975,{"$f":"Sheet1!$B$13*A31^8+Sheet1!$B$14*A31^7+Sheet1!$B$15*A31^6+Sheet1!$B$16*A31^5+Sheet1!$B$17*A31^4+Sheet1!$B$18*A31^3+Sheet1!$B$19*A31^2+Sheet1!$B$20*A31+Sheet1!$B$21","v":-3.6547164359753781}]
[-0.70999999999999974,{"$f":"Sheet1!$B$13*A32^8+Sheet1!$B$14*A32^7+Sheet1!$B$15*A32^6+Sheet1!$B$16*A32^5+Sheet1!$B$17*A32^4+Sheet1!$B$18*A32^3+Sheet1!$B$19*A32^2+Sheet1!$B$20*A32+Sheet1!$B$21","v":-3.8363086319619422}]
[-0.69999999999999973,{"$f":"Sheet1!$B$13*A33^8+Sheet1!$B$14*A33^7+Sheet1!$B$15*A33^6+Sheet1!$B$16*A33^5+Sheet1!$B$17*A33^4+Sheet1!$B$18*A33^3+Sheet1!$B$19*A33^2+Sheet1!$B$20*A33+Sheet1!$B$21","v":-4.005384680000005}]
[-0.68999999999999972,{"$f":"Sheet1!$B$13*A34^8+Sheet1!$B$14*A34^7+Sheet1!$B$15*A34^6+Sheet1!$B$16*A34^5+Sheet1!$B$17*A34^4+Sheet1!$B$18*A34^3+Sheet1!$B$19*A34^2+Sheet1!$B$20*A34+Sheet1!$B$21","v":-4.1625535377833858}]
[-0.67999999999999972,{"$f":"Sheet1!$B$13*A35^8+Sheet1!$B$14*A35^7+Sheet1!$B$15*A35^6+Sheet1!$B$16*A35^5+Sheet1!$B$17*A35^4+Sheet1!$B$18*A35^3+Sheet1!$B$19*A35^2+Sheet1!$B$20*A35+Sheet1!$B$21","v":-4.3083986299650086}]
[-0.66999999999999971,{"$f":"Sheet1!$B$13*A36^8+Sheet1!$B$14*A36^7+Sheet1!$B$15*A36^6+Sheet1!$B$16*A36^5+Sheet1!$B$17*A36^4+Sheet1!$B$18*A36^3+Sheet1!$B$19*A36^2+Sheet1!$B$20*A36+Sheet1!$B$21","v":-4.443478743390445}]
[-0.6599999999999997,{"$f":"Sheet1!$B$13*A37^8+Sheet1!$B$14*A37^7+Sheet1!$B$15*A37^6+Sheet1!$B$16*A37^5+Sheet1!$B$17*A37^4+Sheet1!$B$18*A37^3+Sheet1!$B$19*A37^2+Sheet1!$B$20*A37+Sheet1!$B$21","v":-4.5683288960555046}]
[-0.64999999999999969,{"$f":"Sheet1!$B$13*A38^8+Sheet1!$B$14*A38^7+Sheet1!$B$15*A38^6+Sheet1!$B$16*A38^5+Sheet1!$B$17*A38^4+Sheet1!$B$18*A38^3+Sheet1!$B$19*A38^2+Sheet1!$B$20*A38+Sheet1!$B$21","v":-4.6834611803906281}]
[-0.63999999999999968,{"$f":"Sheet1!$B$13*A39^8+Sheet1!$B$14*A39^7+Sheet1!$B$15*A39^6+Sheet1!$B$16*A39^5+Sheet1!$B$17*A39^4+Sheet1!$B$18*A39^3+Sheet1!$B$19*A39^2+Sheet1!$B$20*A39+Sheet1!$B$21","v":-4.7893655814668321}]
[-0.62999999999999967,{"$f":"Sheet1!$B$13*A40^8+Sheet1!$B$14*A40^7+Sheet1!$B$15*A40^6+Sheet1!$B$16*A40^5+Sheet1!$B$17*A40^4+Sheet1!$B$18*A40^3+Sheet1!$B$19*A40^2+Sheet1!$B$20*A40+Sheet1!$B$21","v":-4.8865107707098288}]
[-0.61999999999999966,{"$f":"Sheet1!$B$13*A41^8+Sheet1!$B$14*A41^7+Sheet1!$B$15*A41^6+Sheet1!$B$16*A41^5+Sheet1!$B$17*A41^4+Sheet1!$B$18*A41^3+Sheet1!$B$19*A41^2+Sheet1!$B$20*A41+Sheet1!$B$21","v":-4.9753448757009435}]
[-0.60999999999999965,{"$f":"Sheet1!$B$13*A42^8+Sheet1!$B$14*A42^7+Sheet1!$B$15*A42^6+Sheet1!$B$16*A42^5+Sheet1!$B$17*A42^4+Sheet1!$B$18*A42^3+Sheet1!$B$19*A42^2+Sheet1!$B$20*A42+Sheet1!$B$21","v":-5.056296226635336}]
[-0.59999999999999964,{"$f":"Sheet1!$B$13*A43^8+Sheet1!$B$14*A43^7+Sheet1!$B$15*A43^6+Sheet1!$B$16*A43^5+Sheet1!$B$17*A43^4+Sheet1!$B$18*A43^3+Sheet1!$B$19*A43^2+Sheet1!$B$20*A43+Sheet1!$B$21","v":-5.1297740800000025}]
[-0.58999999999999964,{"$f":"Sheet1!$B$13*A44^8+Sheet1!$B$14*A44^7+Sheet1!$B$15*A44^6+Sheet1!$B$16*A44^5+Sheet1!$B$17*A44^4+Sheet1!$B$18*A44^3+Sheet1!$B$19*A44^2+Sheet1!$B$20*A44+Sheet1!$B$21","v":-5.1961693200259482}]
[-0.57999999999999963,{"$f":"Sheet1!$B$13*A45^8+Sheet1!$B$14*A45^7+Sheet1!$B$15*A45^6+Sheet1!$B$16*A45^5+Sheet1!$B$17*A45^4+Sheet1!$B$18*A45^3+Sheet1!$B$19*A45^2+Sheet1!$B$20*A45+Sheet1!$B$21","v":-5.2558551384608787}]
[-0.56999999999999962,{"$f":"Sheet1!$B$13*A46^8+Sheet1!$B$14*A46^7+Sheet1!$B$15*A46^6+Sheet1!$B$16*A46^5+Sheet1!$B$17*A46^4+Sheet1!$B$18*A46^3+Sheet1!$B$19*A46^2+Sheet1!$B$20*A46+Sheet1!$B$21","v":-5.3091876932006716}]
[-0.55999999999999961,{"$f":"Sheet1!$B$13*A47^8+Sheet1!$B$14*A47^7+Sheet1!$B$15*A47^6+Sheet1!$B$16*A47^5+Sheet1!$B$17*A47^4+Sheet1!$B$18*A47^3+Sheet1!$B$19*A47^2+Sheet1!$B$20*A47+Sheet1!$B$21","v":-5.3565067463098384}]
[-0.5499999999999996,{"$f":"Sheet1!$B$13*A48^8+Sheet1!$B$14*A48^7+Sheet1!$B$15*A48^6+Sheet1!$B$16*A48^5+Sheet1!$B$17*A48^4+Sheet1!$B$18*A48^3+Sheet1!$B$19*A48^2+Sheet1!$B$20*A48+Sheet1!$B$21","v":-5.3981362819531267}]
[-0.53999999999999959,{"$f":"Sheet1!$B$13*A49^8+Sheet1!$B$14*A49^7+Sheet1!$B$15*A49^6+Sheet1!$B$16*A49^5+Sheet1!$B$17*A49^4+Sheet1!$B$18*A49^3+Sheet1!$B$19*A49^2+Sheet1!$B$20*A49+Sheet1!$B$21","v":-5.4343851047523337}]
[-0.52999999999999958,{"$f":"Sheet1!$B$13*A50^8+Sheet1!$B$14*A50^7+Sheet1!$B$15*A50^6+Sheet1!$B$16*A50^5+Sheet1!$B$17*A50^4+Sheet1!$B$18*A50^3+Sheet1!$B$19*A50^2+Sheet1!$B$20*A50+Sheet1!$B$21","v":-5.4655474190743591}]
[-0.51999999999999957,{"$f":"Sheet1!$B$13*A51^8+Sheet1!$B$14*A51^7+Sheet1!$B$15*A51^6+Sheet1!$B$16*A51^5+Sheet1!$B$17*A51^4+Sheet1!$B$18*A51^3+Sheet1!$B$19*A51^2+Sheet1!$B$20*A51+Sheet1!$B$21","v":-5.4919033897484297}]
[-0.50999999999999956,{"$f":"Sheet1!$B$13*A52^8+Sheet1!$B$14*A52^7+Sheet1!$B$15*A52^6+Sheet1!$B$16*A52^5+Sheet1!$B$17*A52^4+Sheet1!$B$18*A52^3+Sheet1!$B$19*A52^2+Sheet1!$B$20*A52+Sheet1!$B$21","v":-5.5137196847024104}]
[-0.49999999999999956,{"$f":"Sheet1!$B$13*A53^8+Sheet1!$B$14*A53^7+Sheet1!$B$15*A53^6+Sheet1!$B$16*A53^5+Sheet1!$B$17*A53^4+Sheet1!$B$18*A53^3+Sheet1!$B$19*A53^2+Sheet1!$B$20*A53+Sheet1!$B$21","v":-5.5312500000000009}]
[-0.48999999999999955,{"$f":"Sheet1!$B$13*A54^8+Sheet1!$B$14*A54^7+Sheet1!$B$15*A54^6+Sheet1!$B$16*A54^5+Sheet1!$B$17*A54^4+Sheet1!$B$18*A54^3+Sheet1!$B$19*A54^2+Sheet1!$B$20*A54+Sheet1!$B$21","v":-5.54473556775259}]
[-0.47999999999999954,{"$f":"Sheet1!$B$13*A55^8+Sheet1!$B$14*A55^7+Sheet1!$B$15*A55^6+Sheet1!$B$16*A55^5+Sheet1!$B$17*A55^4+Sheet1!$B$18*A55^3+Sheet1!$B$19*A55^2+Sheet1!$B$20*A55+Sheet1!$B$21","v":-5.5544056473714694}]
[-0.46999999999999953,{"$f":"Sheet1!$B$13*A56^8+Sheet1!$B$14*A56^7+Sheet1!$B$15*A56^6+Sheet1!$B$16*A56^5+Sheet1!$B$17*A56^4+Sheet1!$B$18*A56^3+Sheet1!$B$19*A56^2+Sheet1!$B$20*A56+Sheet1!$B$21","v":-5.5604780006180183}]
[-0.45999999999999952,{"$f":"Sheet1!$B$13*A57^8+Sheet1!$B$14*A57^7+Sheet1!$B$15*A57^6+Sheet1!$B$16*A57^5+Sheet1!$B$17*A57^4+Sheet1!$B$18*A57^3+Sheet1!$B$19*A57^2+Sheet1!$B$20*A57+Sheet1!$B$21","v":-5.5631593509014525}]
[-0.44999999999999951,{"$f":"Sheet1!$B$13*A58^8+Sheet1!$B$14*A58^7+Sheet1!$B$15*A58^6+Sheet1!$B$16*A58^5+Sheet1!$B$17*A58^4+Sheet1!$B$18*A58^3+Sheet1!$B$19*A58^2+Sheet1!$B$20*A58+Sheet1!$B$21","v":-5.5626458272656247}]
[-0.4399999999999995,{"$f":"Sheet1!$B$13*A59^8+Sheet1!$B$14*A59^7+Sheet1!$B$15*A59^6+Sheet1!$B$16*A59^5+Sheet1!$B$17*A59^4+Sheet1!$B$18*A59^3+Sheet1!$B$19*A59^2+Sheet1!$B$20*A59+Sheet1!$B$21","v":-5.5591233934983162}]
[-0.42999999999999949,{"$f":"Sheet1!$B$13*A60^8+Sheet1!$B$14*A60^7+Sheet1!$B$15*A60^6+Sheet1!$B$16*A60^5+Sheet1!$B$17*A60^4+Sheet1!$B$18*A60^3+Sheet1!$B$19*A60^2+Sheet1!$B$20*A60+Sheet1!$B$21","v":-5.5527682627884101}]
[-0.41999999999999948,{"$f":"Sheet1!$B$13*A61^8+Sheet1!$B$14*A61^7+Sheet1!$B$15*A61^6+Sheet1!$B$16*A61^5+Sheet1!$B$17*A61^4+Sheet1!$B$18*A61^3+Sheet1!$B$19*A61^2+Sheet1!$B$20*A61+Sheet1!$B$21","v":-5.5437472983482365}]
[-0.40999999999999948,{"$f":"Sheet1!$B$13*A62^8+Sheet1!$B$14*A62^7+Sheet1!$B$15*A62^6+Sheet1!$B$16*A62^5+Sheet1!$B$17*A62^4+Sheet1!$B$18*A62^3+Sheet1!$B$19*A62^2+Sheet1!$B$20*A62+Sheet1!$B$21","v":-5.5322184004103647}]
[-0.39999999999999947,{"$f":"Sheet1!$B$13*A63^8+Sheet1!$B$14*A63^7+Sheet1!$B$15*A63^6+Sheet1!$B$16*A63^5+Sheet1!$B$17*A63^4+Sheet1!$B$18*A63^3+Sheet1!$B$19*A63^2+Sheet1!$B$20*A63+Sheet1!$B$21","v":-5.5183308799999988}]
[-0.38999999999999946,{"$f":"Sheet1!$B$13*A64^8+Sheet1!$B$14*A64^7+Sheet1!$B$15*A64^6+Sheet1!$B$16*A64^5+Sheet1!$B$17*A64^4+Sheet1!$B$18*A64^3+Sheet1!$B$19*A64^2+Sheet1!$B$20*A64+Sheet1!$B$21","v":-5.5022258198761129}]
[-0.37999999999999945,{"$f":"Sheet1!$B$13*A65^8+Sheet1!$B$14*A65^7+Sheet1!$B$15*A65^6+Sheet1!$B$16*A65^5+Sheet1!$B$17*A65^4+Sheet1!$B$18*A65^3+Sheet1!$B$19*A65^2+Sheet1!$B$20*A65+Sheet1!$B$21","v":-5.4840364230263798}]
[-0.36999999999999944,{"$f":"Sheet1!$B$13*A66^8+Sheet1!$B$14*A66^7+Sheet1!$B$15*A66^6+Sheet1!$B$16*A66^5+Sheet1!$B$17*A66^4+Sheet1!$B$18*A66^3+Sheet1!$B$19*A66^2+Sheet1!$B$20*A66+Sheet1!$B$21","v":-5.4638883490928851}]
[-0.35999999999999943,{"$f":"Sheet1!$B$13*A67^8+Sheet1!$B$14*A67^7+Sheet1!$B$15*A67^6+Sheet1!$B$16*A67^5+Sheet1!$B$17*A67^4+Sheet1!$B$18*A67^3+Sheet1!$B$19*A67^2+Sheet1!$B$20*A67+Sheet1!$B$21","v":-5.4419000390975469}]
[{"$f":"A67+dx","v":-0.34999999999999942},{"$f":"Sheet1!$B$13*A68^8+Sheet1!$B$14*A68^7+Sheet1!$B$15*A68^6+Sheet1!$B$16*A68^5+Sheet1!$B$17*A68^4+Sheet1!$B$18*A68^3+Sheet1!$B$19*A68^2+Sheet1!$B$20*A68+Sheet1!$B$21","v":-5.4181830288281239}]
[-0.33999999999999941,{"$f":"Sheet1!$B$13*A69^8+Sheet1!$B$14*A69^7+Sheet1!$B$15*A69^6+Sheet1!$B$16*A69^5+Sheet1!$B$17*A69^4+Sheet1!$B$18*A69^3+Sheet1!$B$19*A69^2+Sheet1!$B$20*A69+Sheet1!$B$21","v":-5.3928422512375791}]
[-0.3299999999999994,{"$f":"Sheet1!$B$13*A70^8+Sheet1!$B$14*A70^7+Sheet1!$B$15*A70^6+Sheet1!$B$16*A70^5+Sheet1!$B$17*A70^4+Sheet1!$B$18*A70^3+Sheet1!$B$19*A70^2+Sheet1!$B$20*A70+Sheet1!$B$21","v":-5.3659763282015804}]
[-0.3199999999999994,{"$f":"Sheet1!$B$13*A71^8+Sheet1!$B$14*A71^7+Sheet1!$B$15*A71^6+Sheet1!$B$16*A71^5+Sheet1!$B$17*A71^4+Sheet1!$B$18*A71^3+Sheet1!$B$19*A71^2+Sheet1!$B$20*A71+Sheet1!$B$21","v":-5.3376778519707635}]
[-0.30999999999999939,{"$f":"Sheet1!$B$13*A72^8+Sheet1!$B$14*A72^7+Sheet1!$B$15*A72^6+Sheet1!$B$16*A72^5+Sheet1!$B$17*A72^4+Sheet1!$B$18*A72^3+Sheet1!$B$19*A72^2+Sheet1!$B$20*A72+Sheet1!$B$21","v":-5.3080336566463995}]
[-0.29999999999999938,{"$f":"Sheet1!$B$13*A73^8+Sheet1!$B$14*A73^7+Sheet1!$B$15*A73^6+Sheet1!$B$16*A73^5+Sheet1!$B$17*A73^4+Sheet1!$B$18*A73^3+Sheet1!$B$19*A73^2+Sheet1!$B$20*A73+Sheet1!$B$21","v":-5.2771250799999976}]
[-0.28999999999999937,{"$f":"Sheet1!$B$13*A74^8+Sheet1!$B$14*A74^7+Sheet1!$B$15*A74^6+Sheet1!$B$16*A74^5+Sheet1!$B$17*A74^4+Sheet1!$B$18*A74^3+Sheet1!$B$19*A74^2+Sheet1!$B$20*A74+Sheet1!$B$21","v":-5.2450282159493158}]
[-0.27999999999999936,{"$f":"Sheet1!$B$13*A75^8+Sheet1!$B$14*A75^7+Sheet1!$B$15*A75^6+Sheet1!$B$16*A75^5+Sheet1!$B$17*A75^4+Sheet1!$B$18*A75^3+Sheet1!$B$19*A75^2+Sheet1!$B$20*A75+Sheet1!$B$21","v":-5.2118141579952102}]
[-0.26999999999999935,{"$f":"Sheet1!$B$13*A76^8+Sheet1!$B$14*A76^7+Sheet1!$B$15*A76^6+Sheet1!$B$16*A76^5+Sheet1!$B$17*A76^4+Sheet1!$B$18*A76^3+Sheet1!$B$19*A76^2+Sheet1!$B$20*A76+Sheet1!$B$21","v":-5.1775492339156717}]
[-0.25999999999999934,{"$f":"Sheet1!$B$13*A77^8+Sheet1!$B$14*A77^7+Sheet1!$B$15*A77^6+Sheet1!$B$16*A77^5+Sheet1!$B$17*A77^4+Sheet1!$B$18*A77^3+Sheet1!$B$19*A77^2+Sheet1!$B$20*A77+Sheet1!$B$21","v":-5.1422952320053223}]
[-0.24999999999999933,{"$f":"Sheet1!$B$13*A78^8+Sheet1!$B$14*A78^7+Sheet1!$B$15*A78^6+Sheet1!$B$16*A78^5+Sheet1!$B$17*A78^4+Sheet1!$B$18*A78^3+Sheet1!$B$19*A78^2+Sheet1!$B$20*A78+Sheet1!$B$21","v":-5.1061096191406223}]
[-0.23999999999999932,{"$f":"Sheet1!$B$13*A79^8+Sheet1!$B$14*A79^7+Sheet1!$B$15*A79^6+Sheet1!$B$16*A79^5+Sheet1!$B$17*A79^4+Sheet1!$B$18*A79^3+Sheet1!$B$19*A79^2+Sheet1!$B$20*A79+Sheet1!$B$21","v":-5.0690457509429221}]
[-0.22999999999999932,{"$f":"Sheet1!$B$13*A80^8+Sheet1!$B$14*A80^7+Sheet1!$B$15*A80^6+Sheet1!$B$16*A80^5+Sheet1!$B$17*A80^4+Sheet1!$B$18*A80^3+Sheet1!$B$19*A80^2+Sheet1!$B$20*A80+Sheet1!$B$21","v":-5.0311530743034716}]
{"$rows_left_out":125}
{"sheet":"Sheet3","index":2,"n_rows":0,"n_cols":0,"rows_kept":0,"cut":false,"hidden":false,"merged":[]}